{"text_format":"1","workbook":"xlsx","n_sheets":4,"sheets":["List","London","Colour","MapEngland"],"not_rendered":{"charts":0,"images":4,"macros":1,"external_links":0,"defined_names":3,"comments":0,"pivot_tables":0},"unopened":[],"bounds":{"document_bytes":16777216,"sheet_cells":100000,"rows_first":2000,"rows_last":500,"rows_between":2000,"halvings":0,"cell_chars":16384,"cell_head_chars":4096},"cells_cut":0,"cells_raw":0,"read":"whole","date_system":"1900"}

{"sheet":"List","index":0,"n_rows":18,"n_cols":23,"rows_kept":18,"cut":false,"hidden":false,"merged":[]}
["Income","Housing Affordability","Avg House Price","Colour",null,{"$f":"OFFSET(A1,,MATCH(MapEngland!$B$2,Metric,0)-1,1,1)","v":"Housing Affordability"},"Colour","Year","Offset",null,"DropDown","DropDown",null,null,"Selection","Red","Green","Blue",null,"Selection","Red","Green","Blue"]
[0,0,0,1,null,{"$f":"OFFSET(A2,,MATCH(MapEngland!$B$2,Metric,0)-1,1,1)","v":0},1,"Yr 1997",null,null,"Income",1,null,"Income","0 - 16,000",253,219,199,null,{"$f":"INDEX($O$2:$O$25,MATCH($F$1,$N$2:$N$25,0),1)","v":"0 - 4.5 Times"},{"$f":"INDEX(P$2:P$25,MATCH($T2,$O$2:$O$25,0),1)","v":173},216,230]
[16000,4.5,90000,2,null,{"$f":"OFFSET(A3,,MATCH(MapEngland!$B$2,Metric,0)-1,1,1)","v":4.5},2,"Yr 1998",null,null,"Housing Affordability",2,null,null,"16,000 to 20,000",244,165,130,null,{"$f":"INDEX($O$2:$O$25,MATCH($F$1,$N$2:$N$25,0)+ROW(A1),1)","v":"4.51 to 5.5 Times"},137,171,209]
[20000,5.5,150000,3,null,{"$f":"OFFSET(A4,,MATCH(MapEngland!$B$2,Metric,0)-1,1,1)","v":5.5},3,"Yr 1999",null,null,"Avg House Price",3,null,null,"20,001 to 22,000",214,96,77,null,{"$f":"INDEX($O$2:$O$25,MATCH($F$1,$N$2:$N$25,0)+ROW(A2),1)","v":"5.51 to 7 Times"},102,127,188]
[22000,7,250000,4,null,{"$f":"OFFSET(A5,,MATCH(MapEngland!$B$2,Metric,0)-1,1,1)","v":7},4,"Yr 2000",null,null,null,null,null,null,"22,001 to 25,000",178,24,73,null,{"$f":"INDEX($O$2:$O$25,MATCH($F$1,$N$2:$N$25,0)+ROW(A3),1)","v":"7.01 to 9 Times"},67,83,167]
[25000,9,480000,5,null,{"$f":"OFFSET(A6,,MATCH(MapEngland!$B$2,Metric,0)-1,1,1)","v":9},5,"Yr 2001",null,null,null,null,null,null,"25,000 +",103,0,21,null,{"$f":"INDEX($O$2:$O$25,MATCH($F$1,$N$2:$N$25,0)+ROW(A4),1)","v":"9 + Times"},14,17,136]
{"$rows_left_out":13}
{"sheet":"London","index":1,"n_rows":82,"n_cols":111,"rows_kept":82,"cut":false,"hidden":false,"merged":[]}
["Region","Desc","Lookup","Self Employment Income","Employment Income","Pension Income","Total Income","Region","Income Grade"," Income 1997"," Income 1998"," Income 1999"," Income 2000"," Income 2001"," Income 2002"," Income 2003"," Income 2004"," Income 2005"," Income 2006"," Income 2007"," Income 2008"," Income 2009"," Income 2010"," Income 2011"," Income 2012"," Income 2013","Income Grade 97","Income Grade 98","Income Grade 99","Income Grade 00","Income Grade 01","Income Grade 02","Income Grade 03","Income Grade 04","Income Grade 05","Income Grade 06","Income Grade 07","Income Grade 08","Income Grade 09","Income Grade 10","Income Grade 11","Income Grade 12","Income Grade 13",1997,1998,1999,2000,2001,2002,2003,2004,2005,2006,2007,2008,2009,2010,2011,2012,2013,"Multiple 97","Multiple 98","Multiple 99","Multiple 00","Multiple 01","Multiple 02","Multiple 03","Multiple 04","Multiple 05","Multiple 06","Multiple 07","Multiple 08","Multiple 09","Multiple 10","Multiple 11","Multiple 12","Multiple 13","Avg Hse 1997","Avg Hse 1998","Avg Hse 1999","Avg Hse 2000","Avg Hse 2001","Avg Hse 2002","Avg Hse 2003","Avg Hse 2004","Avg Hse 2005","Avg Hse 2006","Avg Hse 2007","Avg Hse 2008","Avg Hse 2009","Avg Hse 2010","Avg Hse 2011","Avg Hse 2012","Avg Hse 2013","AvgPrice 97","AvgPrice 98","AvgPrice 99","AvgPrice 00","AvgPrice 01","AvgPrice 02","AvgPrice 03","AvgPrice 04","AvgPrice 05","AvgPrice 06","AvgPrice 07","AvgPrice 08","AvgPrice 09","AvgPrice 10","AvgPrice 11","AvgPrice 12","AvgPrice 13"]
["London","Barking","Barking & Dagenham",10500,19100,8980,18600,3,{"$f":"VLOOKUP(G2,List!$A$2:$D$6,4,1)","v":2},{"$f":"$G2*(1.025)^-COLUMN(J:J)","v":14530.290272098524},{"$f":"$G2*(1.025)^-COLUMN(I:I)","v":14893.547528900988},{"$f":"$G2*(1.025)^-COLUMN(H:H)","v":15265.886217123509},{"$f":"$G2*(1.025)^-COLUMN(G:G)","v":15647.533372551596},{"$f":"$G2*(1.025)^-COLUMN(F:F)","v":16038.721706865384},{"$f":"$G2*(1.025)^-COLUMN(E:E)","v":16439.689749537018},{"$f":"$G2*(1.025)^-COLUMN(D:D)","v":16850.681993275444},{"$f":"$G2*(1.025)^-COLUMN(C:C)","v":17271.949043107328},{"$f":"$G2*(1.025)^-COLUMN(B:B)","v":17703.747769185011},{"$f":"$G2*(1.025)^-COLUMN(A:A)","v":18146.341463414636},{"$f":"$G2*(1.025)^-COLUMN(A:A)","v":18146.341463414636},{"$f":"$G2*(1.025)^0","v":18600},{"$f":"$G2*(1.025)^COLUMN(A:A)","v":19065},{"$f":"$G2*(1.025)^COLUMN(B:B)","v":19541.625},{"$f":"$G2*(1.025)^COLUMN(C:C)","v":20030.165624999998},{"$f":"$G2*(1.025)^COLUMN(D:D)","v":20530.919765624996},{"$f":"$G2*(1.025)^COLUMN(E:E)","v":21044.192759765618},{"$f":"VLOOKUP(J2,List!$A$2:$D$6,4,1)","v":1},{"$f":"VLOOKUP(K2,List!$A$2:$D$6,4,1)","v":1},{"$f":"VLOOKUP(L2,List!$A$2:$D$6,4,1)","v":1},{"$f":"VLOOKUP(M2,List!$A$2:$D$6,4,1)","v":1},{"$f":"VLOOKUP(N2,List!$A$2:$D$6,4,1)","v":2},{"$f":"VLOOKUP(O2,List!$A$2:$D$6,4,1)","v":2},{"$f":"VLOOKUP(P2,List!$A$2:$D$6,4,1)","v":2},{"$f":"VLOOKUP(Q2,List!$A$2:$D$6,4,1)","v":2},{"$f":"VLOOKUP(R2,List!$A$2:$D$6,4,1)","v":2},{"$f":"VLOOKUP(S2,List!$A$2:$D$6,4,1)","v":2},{"$f":"VLOOKUP(T2,List!$A$2:$D$6,4,1)","v":2},{"$f":"VLOOKUP(U2,List!$A$2:$D$6,4,1)","v":2},{"$f":"VLOOKUP(V2,List!$A$2:$D$6,4,1)","v":2},{"$f":"VLOOKUP(W2,List!$A$2:$D$6,4,1)","v":2},{"$f":"VLOOKUP(X2,List!$A$2:$D$6,4,1)","v":3},{"$f":"VLOOKUP(Y2,List!$A$2:$D$6,4,1)","v":3},{"$f":"VLOOKUP(Z2,List!$A$2:$D$6,4,1)","v":3},2.99,2.6,3.03,3.39,4.03,4.22,5.28,5.75,6.03,6.25,6.44,7.23,6.05,6.2200122884444458,5.848460601620217,5.0426400632428505,5.5860720603295784,{"$f":"VLOOKUP(AR2,List!$B$2:$D$6,3,1)","v":1},{"$f":"VLOOKUP(AS2,List!$B$2:$D$6,3,1)","v":1},{"$f":"VLOOKUP(AT2,List!$B$2:$D$6,3,1)","v":1},{"$f":"VLOOKUP(AU2,List!$B$2:$D$6,3,1)","v":1},{"$f":"VLOOKUP(AV2,List!$B$2:$D$6,3,1)","v":1},{"$f":"VLOOKUP(AW2,List!$B$2:$D$6,3,1)","v":1},{"$f":"VLOOKUP(AX2,List!$B$2:$D$6,3,1)","v":2},{"$f":"VLOOKUP(AY2,List!$B$2:$D$6,3,1)","v":3},{"$f":"VLOOKUP(AZ2,List!$B$2:$D$6,3,1)","v":3},{"$f":"VLOOKUP(BA2,List!$B$2:$D$6,3,1)","v":3},{"$f":"VLOOKUP(BB2,List!$B$2:$D$6,3,1)","v":3},{"$f":"VLOOKUP(BC2,List!$B$2:$D$6,3,1)","v":4},{"$f":"VLOOKUP(BD2,List!$B$2:$D$6,3,1)","v":3},{"$f":"VLOOKUP(BE2,List!$B$2:$D$6,3,1)","v":3},{"$f":"VLOOKUP(BF2,List!$B$2:$D$6,3,1)","v":3},{"$f":"VLOOKUP(BG2,List!$B$2:$D$6,3,1)","v":2},{"$f":"VLOOKUP(BH2,List!$B$2:$D$6,3,1)","v":3},56164.708469055375,63972.506800000003,69513.905688073399,84089.5282546495,93748.189968652034,118779.75164967007,145409.3312046444,163770,169489.23405797101,175424.80497569346,193314.04830148621,197629.70609107037,167053,179178.21513665031,180263.6659807954,181866.23954372617,187801.39412157648,{"$f":"VLOOKUP(BZ2,List!$C$2:$D$6,2,1)","v":1},{"$f":"VLOOKUP(CA2,List!$C$2:$D$6,2,1)","v":1},{"$f":"VLOOKUP(CB2,List!$C$2:$D$6,2,1)","v":1},{"$f":"VLOOKUP(CC2,List!$C$2:$D$6,2,1)","v":1},{"$f":"VLOOKUP(CD2,List!$C$2:$D$6,2,1)","v":2},{"$f":"VLOOKUP(CE2,List!$C$2:$D$6,2,1)","v":2},{"$f":"VLOOKUP(CF2,List!$C$2:$D$6,2,1)","v":2},{"$f":"VLOOKUP(CG2,List!$C$2:$D$6,2,1)","v":3},{"$f":"VLOOKUP(CH2,List!$C$2:$D$6,2,1)","v":3},{"$f":"VLOOKUP(CI2,List!$C$2:$D$6,2,1)","v":3},{"$f":"VLOOKUP(CJ2,List!$C$2:$D$6,2,1)","v":3},{"$f":"VLOOKUP(CK2,List!$C$2:$D$6,2,1)","v":3},{"$f":"VLOOKUP(CL2,List!$C$2:$D$6,2,1)","v":3},{"$f":"VLOOKUP(CM2,List!$C$2:$D$6,2,1)","v":3},{"$f":"VLOOKUP(CN2,List!$C$2:$D$6,2,1)","v":3},{"$f":"VLOOKUP(CO2,List!$C$2:$D$6,2,1)","v":3},{"$f":"VLOOKUP(CP2,List!$C$2:$D$6,2,1)","v":3}]
["London","Barnet","Barnet",10900,20300,9360,22000,3,{"$f":"VLOOKUP(G3,List!$A$2:$D$6,4,1)","v":4},17186.364837965997,17616.023958915146,18056.424557888022,18507.835171835221,18970.5310511311,19444.794327409378,19930.914185594611,20429.187040234476,20939.916716240332,21463.414634146342,21463.414634146342,22000,22549.999999999996,23113.75,23691.593749999996,24283.883593749993,24890.980683593742,{"$f":"VLOOKUP(J3,List!$A$2:$D$6,4,1)","v":2},{"$f":"VLOOKUP(K3,List!$A$2:$D$6,4,1)","v":2},{"$f":"VLOOKUP(L3,List!$A$2:$D$6,4,1)","v":2},{"$f":"VLOOKUP(M3,List!$A$2:$D$6,4,1)","v":2},{"$f":"VLOOKUP(N3,List!$A$2:$D$6,4,1)","v":2},{"$f":"VLOOKUP(O3,List!$A$2:$D$6,4,1)","v":2},{"$f":"VLOOKUP(P3,List!$A$2:$D$6,4,1)","v":2},{"$f":"VLOOKUP(Q3,List!$A$2:$D$6,4,1)","v":3},{"$f":"VLOOKUP(R3,List!$A$2:$D$6,4,1)","v":3},{"$f":"VLOOKUP(S3,List!$A$2:$D$6,4,1)","v":3},{"$f":"VLOOKUP(T3,List!$A$2:$D$6,4,1)","v":3},{"$f":"VLOOKUP(U3,List!$A$2:$D$6,4,1)","v":4},{"$f":"VLOOKUP(V3,List!$A$2:$D$6,4,1)","v":4},{"$f":"VLOOKUP(W3,List!$A$2:$D$6,4,1)","v":4},{"$f":"VLOOKUP(X3,List!$A$2:$D$6,4,1)","v":4},{"$f":"VLOOKUP(Y3,List!$A$2:$D$6,4,1)","v":4},{"$f":"VLOOKUP(Z3,List!$A$2:$D$6,4,1)","v":4},5.39,6.13,6.63,7.98,7.89,9.2200000000000006,9.73,9.8000000000000007,9.58,9.73,10.81,10.37,9.1300000000000008,10.682434703319817,10.87776901977913,11.231764607134853,11.788756388415672,{"$f":"VLOOKUP(AR3,List!$B$2:$D$6,3,1)","v":2},{"$f":"VLOOKUP(AS3,List!$B$2:$D$6,3,1)","v":3},{"$f":"VLOOKUP(AT3,List!$B$2:$D$6,3,1)","v":3},{"$f":"VLOOKUP(AU3,List!$B$2:$D$6,3,1)","v":4},{"$f":"VLOOKUP(AV3,List!$B$2:$D$6,3,1)","v":4},{"$f":"VLOOKUP(AW3,List!$B$2:$D$6,3,1)","v":5},{"$f":"VLOOKUP(AX3,List!$B$2:$D$6,3,1)","v":5},{"$f":"VLOOKUP(AY3,List!$B$2:$D$6,3,1)","v":5},{"$f":"VLOOKUP(AZ3,List!$B$2:$D$6,3,1)","v":5},{"$f":"VLOOKUP(BA3,List!$B$2:$D$6,3,1)","v":5},{"$f":"VLOOKUP(BB3,List!$B$2:$D$6,3,1)","v":5},{"$f":"VLOOKUP(BC3,List!$B$2:$D$6,3,1)","v":5},{"$f":"VLOOKUP(BD3,List!$B$2:$D$6,3,1)","v":5},{"$f":"VLOOKUP(BE3,List!$B$2:$D$6,3,1)","v":5},{"$f":"VLOOKUP(BF3,List!$B$2:$D$6,3,1)","v":5},{"$f":"VLOOKUP(BG3,List!$B$2:$D$6,3,1)","v":5},{"$f":"VLOOKUP(BH3,List!$B$2:$D$6,3,1)","v":5},137832.00265585686,149302.06407185629,176850.66510568283,201849.72418377901,220649.03908278051,259984.06265491599,285901.32361709175,311320,321118.88287081342,344733.54296577949,382813.43052291422,389443.1092339062,380868,442467.52221149206,434376.96989966469,445325.82136558252,484320.25438796473,{"$f":"VLOOKUP(BZ3,List!$C$2:$D$6,2,1)","v":2},{"$f":"VLOOKUP(CA3,List!$C$2:$D$6,2,1)","v":2},{"$f":"VLOOKUP(CB3,List!$C$2:$D$6,2,1)","v":3},{"$f":"VLOOKUP(CC3,List!$C$2:$D$6,2,1)","v":3},{"$f":"VLOOKUP(CD3,List!$C$2:$D$6,2,1)","v":3},{"$f":"VLOOKUP(CE3,List!$C$2:$D$6,2,1)","v":4},{"$f":"VLOOKUP(CF3,List!$C$2:$D$6,2,1)","v":4},{"$f":"VLOOKUP(CG3,List!$C$2:$D$6,2,1)","v":4},{"$f":"VLOOKUP(CH3,List!$C$2:$D$6,2,1)","v":4},{"$f":"VLOOKUP(CI3,List!$C$2:$D$6,2,1)","v":4},{"$f":"VLOOKUP(CJ3,List!$C$2:$D$6,2,1)","v":4},{"$f":"VLOOKUP(CK3,List!$C$2:$D$6,2,1)","v":4},{"$f":"VLOOKUP(CL3,List!$C$2:$D$6,2,1)","v":4},{"$f":"VLOOKUP(CM3,List!$C$2:$D$6,2,1)","v":4},{"$f":"VLOOKUP(CN3,List!$C$2:$D$6,2,1)","v":4},{"$f":"VLOOKUP(CO3,List!$C$2:$D$6,2,1)","v":4},{"$f":"VLOOKUP(CP3,List!$C$2:$D$6,2,1)","v":5}]
["London","Bexley","Bexley",12900,20700,10100,19800,3,{"$f":"VLOOKUP(G4,List!$A$2:$D$6,4,1)","v":2},15467.728354169396,15854.421563023632,16250.78210209922,16657.051654651699,17073.477946017993,17500.314894668438,17937.822767035152,18386.268336211026,18845.925044616299,19317.07317073171,19317.07317073171,19800,20295,20802.375,21322.434374999997,21855.495234374994,22401.882615234368,{"$f":"VLOOKUP(J4,List!$A$2:$D$6,4,1)","v":1},{"$f":"VLOOKUP(K4,List!$A$2:$D$6,4,1)","v":1},{"$f":"VLOOKUP(L4,List!$A$2:$D$6,4,1)","v":2},{"$f":"VLOOKUP(M4,List!$A$2:$D$6,4,1)","v":2},{"$f":"VLOOKUP(N4,List!$A$2:$D$6,4,1)","v":2},{"$f":"VLOOKUP(O4,List!$A$2:$D$6,4,1)","v":2},{"$f":"VLOOKUP(P4,List!$A$2:$D$6,4,1)","v":2},{"$f":"VLOOKUP(Q4,List!$A$2:$D$6,4,1)","v":2},{"$f":"VLOOKUP(R4,List!$A$2:$D$6,4,1)","v":2},{"$f":"VLOOKUP(S4,List!$A$2:$D$6,4,1)","v":2},{"$f":"VLOOKUP(T4,List!$A$2:$D$6,4,1)","v":2},{"$f":"VLOOKUP(U4,List!$A$2:$D$6,4,1)","v":2},{"$f":"VLOOKUP(V4,List!$A$2:$D$6,4,1)","v":3},{"$f":"VLOOKUP(W4,List!$A$2:$D$6,4,1)","v":3},{"$f":"VLOOKUP(X4,List!$A$2:$D$6,4,1)","v":3},{"$f":"VLOOKUP(Y4,List!$A$2:$D$6,4,1)","v":3},{"$f":"VLOOKUP(Z4,List!$A$2:$D$6,4,1)","v":4},3.88,4.17,4.3899999999999997,4.88,5.46,6.3,7.23,8.69,7.71,7.68,8.18,7.58,7.02,7.6314248086101388,7.9254961235503218,7.4365126701481676,7.8850359207990186,{"$f":"VLOOKUP(AR4,List!$B$2:$D$6,3,1)","v":1},{"$f":"VLOOKUP(AS4,List!$B$2:$D$6,3,1)","v":1},{"$f":"VLOOKUP(AT4,List!$B$2:$D$6,3,1)","v":1},{"$f":"VLOOKUP(AU4,List!$B$2:$D$6,3,1)","v":2},{"$f":"VLOOKUP(AV4,List!$B$2:$D$6,3,1)","v":2},{"$f":"VLOOKUP(AW4,List!$B$2:$D$6,3,1)","v":3},{"$f":"VLOOKUP(AX4,List!$B$2:$D$6,3,1)","v":4},{"$f":"VLOOKUP(AY4,List!$B$2:$D$6,3,1)","v":4},{"$f":"VLOOKUP(AZ4,List!$B$2:$D$6,3,1)","v":4},{"$f":"VLOOKUP(BA4,List!$B$2:$D$6,3,1)","v":4},{"$f":"VLOOKUP(BB4,List!$B$2:$D$6,3,1)","v":4},{"$f":"VLOOKUP(BC4,List!$B$2:$D$6,3,1)","v":4},{"$f":"VLOOKUP(BD4,List!$B$2:$D$6,3,1)","v":4},{"$f":"VLOOKUP(BE4,List!$B$2:$D$6,3,1)","v":4},{"$f":"VLOOKUP(BF4,List!$B$2:$D$6,3,1)","v":4},{"$f":"VLOOKUP(BG4,List!$B$2:$D$6,3,1)","v":4},{"$f":"VLOOKUP(BH4,List!$B$2:$D$6,3,1)","v":4},75438.299811439341,85573.530730129394,94531.543377226961,109634.00090151002,125900.19410977242,151078.58132158589,175293.36963562752,189079,196126.8954049251,209146.17395727366,225114.42288457692,219711.90656463956,209495,226816.86764108812,226318.52401574844,225744.76217561346,235756.02925531924,{"$f":"VLOOKUP(BZ4,List!$C$2:$D$6,2,1)","v":1},{"$f":"VLOOKUP(CA4,List!$C$2:$D$6,2,1)","v":1},{"$f":"VLOOKUP(CB4,List!$C$2:$D$6,2,1)","v":2},{"$f":"VLOOKUP(CC4,List!$C$2:$D$6,2,1)","v":2},{"$f":"VLOOKUP(CD4,List!$C$2:$D$6,2,1)","v":2},{"$f":"VLOOKUP(CE4,List!$C$2:$D$6,2,1)","v":3},{"$f":"VLOOKUP(CF4,List!$C$2:$D$6,2,1)","v":3},{"$f":"VLOOKUP(CG4,List!$C$2:$D$6,2,1)","v":3},{"$f":"VLOOKUP(CH4,List!$C$2:$D$6,2,1)","v":3},{"$f":"VLOOKUP(CI4,List!$C$2:$D$6,2,1)","v":3},{"$f":"VLOOKUP(CJ4,List!$C$2:$D$6,2,1)","v":3},{"$f":"VLOOKUP(CK4,List!$C$2:$D$6,2,1)","v":3},{"$f":"VLOOKUP(CL4,List!$C$2:$D$6,2,1)","v":3},{"$f":"VLOOKUP(CM4,List!$C$2:$D$6,2,1)","v":3},{"$f":"VLOOKUP(CN4,List!$C$2:$D$6,2,1)","v":3},{"$f":"VLOOKUP(CO4,List!$C$2:$D$6,2,1)","v":3},{"$f":"VLOOKUP(CP4,List!$C$2:$D$6,2,1)","v":3}]
["London","Brent","Brent",10500,17900,9200,18300,3,{"$f":"VLOOKUP(G5,List!$A$2:$D$6,4,1)","v":2},14295.930751580805,14653.329020370327,15019.662245879581,15395.153802026569,15780.032647077234,16174.533463254164,16578.896799835518,16993.369219831406,17418.203450327186,17853.658536585368,17853.658536585368,18300,18757.5,19226.4375,19707.098437499997,20199.775898437496,20704.77029589843,{"$f":"VLOOKUP(J5,List!$A$2:$D$6,4,1)","v":1},{"$f":"VLOOKUP(K5,List!$A$2:$D$6,4,1)","v":1},{"$f":"VLOOKUP(L5,List!$A$2:$D$6,4,1)","v":1},{"$f":"VLOOKUP(M5,List!$A$2:$D$6,4,1)","v":1},{"$f":"VLOOKUP(N5,List!$A$2:$D$6,4,1)","v":1},{"$f":"VLOOKUP(O5,List!$A$2:$D$6,4,1)","v":2},{"$f":"VLOOKUP(P5,List!$A$2:$D$6,4,1)","v":2},{"$f":"VLOOKUP(Q5,List!$A$2:$D$6,4,1)","v":2},{"$f":"VLOOKUP(R5,List!$A$2:$D$6,4,1)","v":2},{"$f":"VLOOKUP(S5,List!$A$2:$D$6,4,1)","v":2},{"$f":"VLOOKUP(T5,List!$A$2:$D$6,4,1)","v":2},{"$f":"VLOOKUP(U5,List!$A$2:$D$6,4,1)","v":2},{"$f":"VLOOKUP(V5,List!$A$2:$D$6,4,1)","v":2},{"$f":"VLOOKUP(W5,List!$A$2:$D$6,4,1)","v":2},{"$f":"VLOOKUP(X5,List!$A$2:$D$6,4,1)","v":2},{"$f":"VLOOKUP(Y5,List!$A$2:$D$6,4,1)","v":3},{"$f":"VLOOKUP(Z5,List!$A$2:$D$6,4,1)","v":3},4.4800000000000004,4.92,5.49,6.34,7.22,8.4600000000000009,9.2200000000000006,9.92,10.11,9.58,10.74,10.97,9.69,9.9446117292540599,10.842444592036999,11.424712673576579,12.484839837340372,{"$f":"VLOOKUP(AR5,List!$B$2:$D$6,3,1)","v":1},{"$f":"VLOOKUP(AS5,List!$B$2:$D$6,3,1)","v":2},{"$f":"VLOOKUP(AT5,List!$B$2:$D$6,3,1)","v":2},{"$f":"VLOOKUP(AU5,List!$B$2:$D$6,3,1)","v":3},{"$f":"VLOOKUP(AV5,List!$B$2:$D$6,3,1)","v":4},{"$f":"VLOOKUP(AW5,List!$B$2:$D$6,3,1)","v":4},{"$f":"VLOOKUP(AX5,List!$B$2:$D$6,3,1)","v":5},{"$f":"VLOOKUP(AY5,List!$B$2:$D$6,3,1)","v":5},{"$f":"VLOOKUP(AZ5,List!$B$2:$D$6,3,1)","v":5},{"$f":"VLOOKUP(BA5,List!$B$2:$D$6,3,1)","v":5},{"$f":"VLOOKUP(BB5,List!$B$2:$D$6,3,1)","v":5},{"$f":"VLOOKUP(BC5,List!$B$2:$D$6,3,1)","v":5},{"$f":"VLOOKUP(BD5,List!$B$2:$D$6,3,1)","v":5},{"$f":"VLOOKUP(BE5,List!$B$2:$D$6,3,1)","v":5},{"$f":"VLOOKUP(BF5,List!$B$2:$D$6,3,1)","v":5},{"$f":"VLOOKUP(BG5,List!$B$2:$D$6,3,1)","v":5},{"$f":"VLOOKUP(BH5,List!$B$2:$D$6,3,1)","v":5},96575.214732142864,111516.54641675855,125466.41844403819,154854.55842185128,176187.59798891854,209963.25583798304,232628.88318670576,249785,266941.8361128929,284785.80154440156,322262.38037097908,331542.3670825336,322904,345643.22356874216,360897.44149908598,390197.62121963385,435227.1335460344,{"$f":"VLOOKUP(BZ5,List!$C$2:$D$6,2,1)","v":2},{"$f":"VLOOKUP(CA5,List!$C$2:$D$6,2,1)","v":2},{"$f":"VLOOKUP(CB5,List!$C$2:$D$6,2,1)","v":2},{"$f":"VLOOKUP(CC5,List!$C$2:$D$6,2,1)","v":3},{"$f":"VLOOKUP(CD5,List!$C$2:$D$6,2,1)","v":3},{"$f":"VLOOKUP(CE5,List!$C$2:$D$6,2,1)","v":3},{"$f":"VLOOKUP(CF5,List!$C$2:$D$6,2,1)","v":3},{"$f":"VLOOKUP(CG5,List!$C$2:$D$6,2,1)","v":3},{"$f":"VLOOKUP(CH5,List!$C$2:$D$6,2,1)","v":4},{"$f":"VLOOKUP(CI5,List!$C$2:$D$6,2,1)","v":4},{"$f":"VLOOKUP(CJ5,List!$C$2:$D$6,2,1)","v":4},{"$f":"VLOOKUP(CK5,List!$C$2:$D$6,2,1)","v":4},{"$f":"VLOOKUP(CL5,List!$C$2:$D$6,2,1)","v":4},{"$f":"VLOOKUP(CM5,List!$C$2:$D$6,2,1)","v":4},{"$f":"VLOOKUP(CN5,List!$C$2:$D$6,2,1)","v":4},{"$f":"VLOOKUP(CO5,List!$C$2:$D$6,2,1)","v":4},{"$f":"VLOOKUP(CP5,List!$C$2:$D$6,2,1)","v":4}]
["London","Bromley","Bromley",12000,23100,11500,23200,3,{"$f":"VLOOKUP(G6,List!$A$2:$D$6,4,1)","v":4},18123.802920036869,18576.89799303779,19041.320442863733,19517.353453935324,20005.287290283708,20505.419472540798,21018.054959354318,21543.506333338173,22082.093991671623,22634.146341463416,22634.146341463416,23200,23779.999999999996,24374.499999999996,24983.862499999996,25608.459062499995,26248.670539062492,{"$f":"VLOOKUP(J6,List!$A$2:$D$6,4,1)","v":2},{"$f":"VLOOKUP(K6,List!$A$2:$D$6,4,1)","v":2},{"$f":"VLOOKUP(L6,List!$A$2:$D$6,4,1)","v":2},{"$f":"VLOOKUP(M6,List!$A$2:$D$6,4,1)","v":2},{"$f":"VLOOKUP(N6,List!$A$2:$D$6,4,1)","v":3},{"$f":"VLOOKUP(O6,List!$A$2:$D$6,4,1)","v":3},{"$f":"VLOOKUP(P6,List!$A$2:$D$6,4,1)","v":3},{"$f":"VLOOKUP(Q6,List!$A$2:$D$6,4,1)","v":3},{"$f":"VLOOKUP(R6,List!$A$2:$D$6,4,1)","v":4},{"$f":"VLOOKUP(S6,List!$A$2:$D$6,4,1)","v":4},{"$f":"VLOOKUP(T6,List!$A$2:$D$6,4,1)","v":4},{"$f":"VLOOKUP(U6,List!$A$2:$D$6,4,1)","v":4},{"$f":"VLOOKUP(V6,List!$A$2:$D$6,4,1)","v":4},{"$f":"VLOOKUP(W6,List!$A$2:$D$6,4,1)","v":4},{"$f":"VLOOKUP(X6,List!$A$2:$D$6,4,1)","v":4},{"$f":"VLOOKUP(Y6,List!$A$2:$D$6,4,1)","v":5},{"$f":"VLOOKUP(Z6,List!$A$2:$D$6,4,1)","v":5},5.72,5.87,6.52,7.91,9.34,9.94,10.73,10.6,9.2799999999999994,9.39,9.9499999999999993,9.3699999999999992,8.77,9.8244777585742948,9.6360111502414725,9.4771758016111196,10.461783439490446,{"$f":"VLOOKUP(AR6,List!$B$2:$D$6,3,1)","v":3},{"$f":"VLOOKUP(AS6,List!$B$2:$D$6,3,1)","v":3},{"$f":"VLOOKUP(AT6,List!$B$2:$D$6,3,1)","v":3},{"$f":"VLOOKUP(AU6,List!$B$2:$D$6,3,1)","v":4},{"$f":"VLOOKUP(AV6,List!$B$2:$D$6,3,1)","v":5},{"$f":"VLOOKUP(AW6,List!$B$2:$D$6,3,1)","v":5},{"$f":"VLOOKUP(AX6,List!$B$2:$D$6,3,1)","v":5},{"$f":"VLOOKUP(AY6,List!$B$2:$D$6,3,1)","v":5},{"$f":"VLOOKUP(AZ6,List!$B$2:$D$6,3,1)","v":5},{"$f":"VLOOKUP(BA6,List!$B$2:$D$6,3,1)","v":5},{"$f":"VLOOKUP(BB6,List!$B$2:$D$6,3,1)","v":5},{"$f":"VLOOKUP(BC6,List!$B$2:$D$6,3,1)","v":5},{"$f":"VLOOKUP(BD6,List!$B$2:$D$6,3,1)","v":4},{"$f":"VLOOKUP(BE6,List!$B$2:$D$6,3,1)","v":5},{"$f":"VLOOKUP(BF6,List!$B$2:$D$6,3,1)","v":5},{"$f":"VLOOKUP(BG6,List!$B$2:$D$6,3,1)","v":5},{"$f":"VLOOKUP(BH6,List!$B$2:$D$6,3,1)","v":5},105606.13154785348,117823.08173610011,138058.59017724259,164791.36339165544,181632.97295885041,210277.93939018343,238207.22813186812,260528,267626.0153920154,283433.02815029601,316593.41641641641,305493.25466169417,301800,327495.45103857567,336398.65315106633,332919.0324142293,354679.05622326315,{"$f":"VLOOKUP(BZ6,List!$C$2:$D$6,2,1)","v":2},{"$f":"VLOOKUP(CA6,List!$C$2:$D$6,2,1)","v":2},{"$f":"VLOOKUP(CB6,List!$C$2:$D$6,2,1)","v":2},{"$f":"VLOOKUP(CC6,List!$C$2:$D$6,2,1)","v":3},{"$f":"VLOOKUP(CD6,List!$C$2:$D$6,2,1)","v":3},{"$f":"VLOOKUP(CE6,List!$C$2:$D$6,2,1)","v":3},{"$f":"VLOOKUP(CF6,List!$C$2:$D$6,2,1)","v":3},{"$f":"VLOOKUP(CG6,List!$C$2:$D$6,2,1)","v":4},{"$f":"VLOOKUP(CH6,List!$C$2:$D$6,2,1)","v":4},{"$f":"VLOOKUP(CI6,List!$C$2:$D$6,2,1)","v":4},{"$f":"VLOOKUP(CJ6,List!$C$2:$D$6,2,1)","v":4},{"$f":"VLOOKUP(CK6,List!$C$2:$D$6,2,1)","v":4},{"$f":"VLOOKUP(CL6,List!$C$2:$D$6,2,1)","v":4},{"$f":"VLOOKUP(CM6,List!$C$2:$D$6,2,1)","v":4},{"$f":"VLOOKUP(CN6,List!$C$2:$D$6,2,1)","v":4},{"$f":"VLOOKUP(CO6,List!$C$2:$D$6,2,1)","v":4},{"$f":"VLOOKUP(CP6,List!$C$2:$D$6,2,1)","v":4}]
{"$rows_left_out":77}
{"sheet":"Colour","index":2,"n_rows":28,"n_cols":20,"rows_kept":28,"cut":false,"hidden":false,"merged":[]}
["Selection","Region","Red","Green","Blue",null,"Income","Red","Green","Blue",null,"House","Red","Green","Blue",null,"Avg Hse","Red","Green","Blue"]
["Region","East",173,216,230,null,"0 - 16,000",253,219,199,null,"0 - 4.5 Times",173,216,230,null,"0 - 90,000",217,239,139]
["Region","East Midlands",84,105,177,null,"16,000 to 20,000",244,165,130,null,"4.51 to 5.5 Times",137,171,209,null,"90,000-150000",166,217,106]
["Region","London",31,39,146,null,"20,001 to 22,000",214,96,77,null,"5.51 to 7 Times",102,127,188,null,"150,001 - 350,000",102,189,99]
["Region","North East",255,99,71,null,"22,001 to 25,000",178,24,73,null,"7.01 to 9 Times",67,83,167,null,"350,000 - 480,000",26,152,80]
["Region","North West",183,38,27,null,"25,000 +",103,0,21,null,"9 + Times",14,17,136,null,"480,001  +",0,104,55]
{"$rows_left_out":23}
{"sheet":"MapEngland","index":3,"n_rows":34,"n_cols":37,"rows_kept":34,"cut":false,"hidden":false,"merged":[]}
[null,"Yr 2013",{"$f":"MATCH(B1,Year,0)-2","v":15}]
[null,"Housing Affordability",{"$f":"MATCH(B2,Metric,0)","v":2}]
[]
[]
[]
[]
{"$rows_left_out":28}