{"text_format":"1","workbook":"xlsx","n_sheets":13,"sheets":["Model","Lists","Data","Plan","Cust","Hires","Sick","FTE","General","Other","Calcs","Check","Summary"],"not_rendered":{"charts":5,"images":16,"macros":1,"external_links":0,"defined_names":2,"comments":0,"pivot_tables":0},"unopened":[],"bounds":{"document_bytes":16777216,"sheet_cells":100000,"rows_first":2000,"rows_last":500,"rows_between":2000,"halvings":0,"cell_chars":16384,"cell_head_chars":4096},"cells_cut":0,"cells_raw":0,"read":"whole","date_system":"1900"}

{"sheet":"Model","index":0,"n_rows":14,"n_cols":5,"rows_kept":14,"cut":false,"hidden":false,"merged":[]}
[null,"Sheets","Sheet Type","Description","Links"]
[null,"Model","Assumptions","Description of Sheets",{"$f":"HYPERLINK(\"#\"&B2&\"!A2\",B2)","v":"Model"}]
[null,"List","Assumptions","Lists and model assumptions",{"$f":"HYPERLINK(\"#\"&B3&\"!A2\",B3)","v":"List"}]
[null,"Data","Input Sheet","Actual lead metrics by region","Data"]
[null,"Plan","Input Sheet","Plan lead metrics by region","Plan"]
[null,"Cust","Input Sheet","Customer data (small data set)","Cust"]
[null,"Hires","Input Sheet","Hires and terminations","Hires"]
[null,"Sick","Input Sheet","Average sick days per employee","Sick"]
[null,"FTE","Input Sheet","Full time equivalent workers","FTE"]
[null,"General","Input Sheet","General financial metrics","General"]
{"$rows_left_out":5}
{"sheet":"Lists","index":1,"n_rows":12,"n_cols":8,"rows_kept":12,"cut":false,"hidden":false,"merged":[]}
["Metric","Measures",null,"Hires","Years","Regions",null,"Checks"]
["Linked Cell Spinner",{"$f":"Summary!B5","v":1},null,"FY 10","FY 12","England",null,"Model OK"]
["Linked Cell Listbox","Net Interest Margin",null,"FY 11","FY 13","Scotland",null,"Check Model"]
["Region Cell Link",1,null,"FY 12","FY 14","Wales"]
["Region",{"$f":"OFFSET(F1,B4,0,1,1)","v":"England"},null,"FY 13","FY 15","Northern Ireland"]
[null,null,null,"FY 14","FY 16"]
[null,null,null,"FY 15","FY 17"]
[null,null,null,"FY 16","FY 18"]
[null,null,null,"FY 17","FY 19"]
[null,null,null,"FY 18","FY 20"]
{"$rows_left_out":3}
{"sheet":"Data","index":2,"n_rows":68,"n_cols":11,"rows_kept":68,"cut":false,"hidden":false,"merged":[]}
["Region","Activity",{"$f":"OFFSET(Lists!$E$1,COLUMN()-2,0,1,1)","v":"FY 12"},{"$f":"OFFSET(Lists!$E$1,COLUMN()-2,0,1,1)","v":"FY 13"},{"$f":"OFFSET(Lists!$E$1,COLUMN()-2,0,1,1)","v":"FY 14"},{"$f":"OFFSET(Lists!$E$1,COLUMN()-2,0,1,1)","v":"FY 15"},{"$f":"OFFSET(Lists!$E$1,COLUMN()-2,0,1,1)","v":"FY 16"},{"$f":"OFFSET(Lists!$E$1,COLUMN()-2,0,1,1)","v":"FY 17"},{"$f":"OFFSET(Lists!$E$1,COLUMN()-2,0,1,1)","v":"FY 18"},{"$f":"OFFSET(Lists!$E$1,COLUMN()-2,0,1,1)","v":"FY 19"},{"$f":"OFFSET(Lists!$E$1,COLUMN()-2,0,1,1)","v":"FY 20"}]
["England","Net Income",7400,8100,8300,9600,10200,10000,10200,10600,10300]
["England","Revenue",28900,33569,34511,35678,38976,40014,41017.5,42521.875,48152.34375]
["England","Diluted Earnings Per Share",3.1,3.2,3.35,3.4,3.45,3.6,4.5,5.625,7.03125]
["England","Dividends Per Share",0.97,1.05,1.1100000000000001,1.2,1.23,1.28,1.6,2,2.5]
["England","Return on Assets",2.6,2.4,2.6,2.5,2.5,2.6,3.25,4.0625,5.078125]
["England","Return on Equity",23.4,22.7,26.8,25.7,27.6,28.6,30.75,25.6875,22.859375]
["England","Net Interest Margin",7.5,7.8,8.3000000000000007,8.3000000000000007,8.4,8.6999999999999993,8.875,9,8.6999999999999993]
["England","Efficiency Ratio",0.84,0.9,0.85,0.87,0.84,0.88,1.1000000000000001,1.375,1.71875]
["England","Assets",440000,465000,480000,520000,550000,620000,675000,698750,668750]
{"$rows_left_out":59}
{"sheet":"Plan","index":3,"n_rows":68,"n_cols":11,"rows_kept":68,"cut":false,"hidden":false,"merged":[]}
["Region","Activity",{"$f":"OFFSET(Lists!$E$1,COLUMN()-2,0,1,1)","v":"FY 12"},{"$f":"OFFSET(Lists!$E$1,COLUMN()-2,0,1,1)","v":"FY 13"},{"$f":"OFFSET(Lists!$E$1,COLUMN()-2,0,1,1)","v":"FY 14"},{"$f":"OFFSET(Lists!$E$1,COLUMN()-2,0,1,1)","v":"FY 15"},{"$f":"OFFSET(Lists!$E$1,COLUMN()-2,0,1,1)","v":"FY 16"},{"$f":"OFFSET(Lists!$E$1,COLUMN()-2,0,1,1)","v":"FY 17"},{"$f":"OFFSET(Lists!$E$1,COLUMN()-2,0,1,1)","v":"FY 18"},{"$f":"OFFSET(Lists!$E$1,COLUMN()-2,0,1,1)","v":"FY 19"},{"$f":"OFFSET(Lists!$E$1,COLUMN()-2,0,1,1)","v":"FY 20"}]
["England","Net Income",7759.64,8164.8,8784.7200000000012,9940.8000000000011,10395.84,9595,10659,10674.2,10090.91]
["England","Revenue",28322,32561.93,32785.449999999997,34607.660000000003,37806.720000000001,39213.72,40197.15,41671.4375,46707.7734375]
["England","Diluted Earnings Per Share",2.9449999999999998,3.0720000000000005,3.1825000000000001,3.2639999999999998,3.3120000000000003,3.528,4.32,5.5125000000000002,6.6796875]
["England","Dividends Per Share",0.96030000000000004,0.99750000000000005,1.0656000000000001,1.1759999999999999,1.2054,1.2416,1.5680000000000001,1.98,2.4]
["England","Return on Assets",2.8028000000000004,2.5113599999999998,2.5441000000000003,2.5887500000000001,2.5725000000000002,2.7541800000000003,3.3345000000000002,4.0210625000000002,5.4244531250000003]
["England","Return on Equity",23.166,21.565000000000001,26.532000000000004,25.442999999999998,27.324000000000002,27.456000000000003,30.135000000000002,25.430624999999999,22.4021875]
["England","Net Interest Margin",7.125,7.6440000000000001,7.9680000000000009,8.0510000000000002,8.3160000000000007,8.6129999999999995,8.7862500000000008,8.64,8.3519999999999985]
["England","Efficiency Ratio",0.83160000000000001,0.8640000000000001,0.84149999999999991,0.82650000000000001,0.82319999999999993,0.83599999999999997,1.0669999999999999,1.33375,1.65]
["England","Assets",466092,506385.00000000006,512160.00000000006,539136,564300,619938,661297.5,704899,648420]
{"$rows_left_out":59}
{"sheet":"Cust","index":4,"n_rows":5,"n_cols":4,"rows_kept":5,"cut":false,"hidden":false,"merged":[]}
["Satisfaction","States","PY","CY"]
["Customer","England",0.87,0.83]
["Customer","Scotland",0.8,0.85]
["Customer","Wales",0.88,0.92]
["Customer","Northern Ireland",0.83,0.81]

{"sheet":"Hires","index":5,"n_rows":9,"n_cols":13,"rows_kept":9,"cut":false,"hidden":false,"merged":[]}
["Type","State",{"$f":"TRANSPOSE(Lists!D2:D12)","v":"FY 10"},"FY 11","FY 12","FY 13","FY 14","FY 15","FY 16","FY 17","FY 18","FY 19","FY 20"]
["Termination","England",-416.16,-234.78,-612,-511,-408,-301,-354,-102,-408,-102,-321]
["New Hires","England",599.76,264.47999999999996,408,514,612,232,387,418,714,517,411]
["Termination","Scotland",-313.04000000000002,-189.72,-816,-301,-301,-204,-354,-204,-612,-102,-102]
["New Hires","Scotland",278.88,220.89999999999998,612,714,332,235,519,412,1020,1122,714]
["Termination","Wales",-233.22,-357.12,-714,-312,-299,-288,-204,-354,-354,-102,-102]
["New Hires","Wales",473.28,705.18,455,1122,408,511,432,612,918,1428,714]
["Termination","Northern Ireland",-534.48,-240.8,-408,-301,-408,-301,-298,-300,-204,-102,-204]
["New Hires","Northern Ireland",369.74,257.52000000000004,408,1122,278,232,333,816,714,530,714]

{"sheet":"Sick","index":6,"n_rows":10,"n_cols":14,"rows_kept":10,"cut":false,"hidden":false,"merged":[]}
["Avg Sick Days","Country","Jul","Aug","Sep","Oct","Nov","Dec","Jan","Feb","Mar","Apr","May","Jun"]
["CY","England",7.7616000000000005,9.7944000000000031,7.4844000000000017,10.348800000000002,9.3324000000000016,9.9792000000000023,8.5008000000000017,10.348800000000002,8.6856000000000009,7.9464000000000006,8.4084000000000021,8.7780000000000005]
["CY","Scotland",7.7000000000000011,8.9133000000000013,6.5846,8.9936000000000007,8.9133000000000013,9.0739000000000001,7.6284999999999998,8.9133000000000013,6.6648999999999994,6.5043000000000006,8.270900000000001,8.5921000000000003]
["CY","Wales",5.9344999999999999,6.5065000000000008,6.9355000000000002,6.5065000000000008,7.0070000000000006,5.9344999999999999,7.7935000000000016,5.791500000000001,7.7935000000000016,5.791500000000001,6.9355000000000002,6.7925000000000004]
["CY","Northern Ireland",8.2720000000000002,9.3280000000000012,8.36,8.8000000000000007,9.6800000000000015,9.9439999999999991,9.4160000000000021,10.032,7.128000000000001,10.472,10.56,7.0400000000000009]
[]
["PY","England",6.5620800000000008,8.2807200000000023,6.2596800000000012,8.4672000000000018,7.2962400000000001,7.3483200000000011,6.2596800000000012,7.5264000000000015,6.6326399999999994,5.9236800000000001,6.6502800000000004,7.5809999999999995]
["PY","Scotland",7.2,7.3737300000000001,6.46488,7.6854399999999998,7.697849999999999,7.7540599999999982,6.2414999999999994,8.751240000000001,5.5742799999999999,5.7356100000000003,6.7671000000000001,7.4985599999999994]
["PY","Wales",4.6396999999999995,5.0277500000000002,5.4853499999999995,5.5600999999999994,5.9241000000000001,5.1252499999999994,6.0222500000000005,4.2646500000000005,6.2348000000000008,4.8438000000000008,5.989749999999999,5.6192500000000001]
["PY","Northern Ireland",7.219199999999999,8.9040000000000017,8.4359999999999999,7.76,10.295999999999999,9.3111999999999995,9.0736000000000008,9.3023999999999987,6.1559999999999997,9.1391999999999989,8.64,6.016]
{"$rows_left_out":1}
{"sheet":"FTE","index":7,"n_rows":24,"n_cols":5,"rows_kept":24,"cut":false,"hidden":false,"merged":[]}
["Region","Metric","Year","Type","Data"]
["England","FTEs","Prior Yr","Actual",5217.7951525493299]
["England","FTEs","Prior Yr","Plan",5098.3368102676704]
["England","FTEs","Cur Yr","Actual",6942.3236953118912]
["England","FTEs","Cur Yr","Plan",6973.1981852567769]
["England","FTEs","Cur Yr","Forecast",6673.1981852567797]
[]
["Scotland","FTEs","Prior Yr","Actual",1721.872400341279]
["Scotland","FTEs","Prior Yr","Plan",1682.4511473883313]
["Scotland","FTEs","Cur Yr","Actual",2290.966819452924]
{"$rows_left_out":15}
{"sheet":"General","index":8,"n_rows":40,"n_cols":3,"rows_kept":40,"cut":false,"hidden":false,"merged":[]}
["Region","Operation","% Result"]
["England","Home Loans",0.12]
["England","Credit Cards",0.25]
["England","Houshold Lending",0.04]
["England","Other Bank Income",0.02]
["England","Retail Deposits",0.06]
["England","Business Lending",0.18]
["England","Asset Finance",0.2]
["England","Equities Trading",0.1]
["England","FX Trading",0.03]
{"$rows_left_out":31}
{"sheet":"Other","index":9,"n_rows":40,"n_cols":3,"rows_kept":40,"cut":false,"hidden":false,"merged":[]}
["Region","Activity","Current Mth"]
["England","Interest Income",166.66666666666669]
["England","Funds Mgt Income",333.33333333333337]
["England","Insurance Income",250]
["England","Other Bank Income",83.333333333333343]
["England","Net Income",833.33333333333337]
["England","Operational Expenses",416.66666666666669]
["England","Loan Imparement Expenses",104.16666666666667]
["England","Net Expenses",520.83333333333337]
["England","Net Profit",312.5]
{"$rows_left_out":31}
{"sheet":"Calcs","index":10,"n_rows":88,"n_cols":14,"rows_kept":88,"cut":false,"hidden":false,"merged":[]}
[]
["Graph Data",{"$f":"Summary!J10","v":"FY 12"},{"$f":"Summary!K10","v":"FY 13"},{"$f":"Summary!L10","v":"FY 14"},{"$f":"Summary!M10","v":"FY 15"},{"$f":"Summary!N10","v":"FY 16"},{"$f":"Summary!O10","v":"FY 17"}]
[{"$f":"Lists!B3","v":"Net Interest Margin"},{"$f":"SUMPRODUCT((Data!$B$2:$B$68=$A3)*(Data!$A$2:$A$68=$A$7)*(Data!$C$1:$K$1=B$2)*(Data!$C$2:$K$68))","v":7.5},{"$f":"SUMPRODUCT((Data!$B$2:$B$68=$A3)*(Data!$A$2:$A$68=$A$7)*(Data!$C$1:$K$1=C$2)*(Data!$C$2:$K$68))","v":7.8},{"$f":"SUMPRODUCT((Data!$B$2:$B$68=$A3)*(Data!$A$2:$A$68=$A$7)*(Data!$C$1:$K$1=D$2)*(Data!$C$2:$K$68))","v":8.3000000000000007},{"$f":"SUMPRODUCT((Data!$B$2:$B$68=$A3)*(Data!$A$2:$A$68=$A$7)*(Data!$C$1:$K$1=E$2)*(Data!$C$2:$K$68))","v":8.3000000000000007},{"$f":"SUMPRODUCT((Data!$B$2:$B$68=$A3)*(Data!$A$2:$A$68=$A$7)*(Data!$C$1:$K$1=F$2)*(Data!$C$2:$K$68))","v":8.4},{"$f":"SUMPRODUCT((Data!$B$2:$B$68=$A3)*(Data!$A$2:$A$68=$A$7)*(Data!$C$1:$K$1=G$2)*(Data!$C$2:$K$68))","v":8.6999999999999993}]
["Plan",{"$f":"SUMPRODUCT((Plan!$B$2:$B$68=$A3)*(Plan!$A$2:$A$68=$A$7)*(Plan!$C$1:$K$1=B$2)*(Plan!$C$2:$K$68))","v":7.125},{"$f":"SUMPRODUCT((Plan!$B$2:$B$68=$A3)*(Plan!$A$2:$A$68=$A$7)*(Plan!$C$1:$K$1=C$2)*(Plan!$C$2:$K$68))","v":7.6440000000000001},{"$f":"SUMPRODUCT((Plan!$B$2:$B$68=$A3)*(Plan!$A$2:$A$68=$A$7)*(Plan!$C$1:$K$1=D$2)*(Plan!$C$2:$K$68))","v":7.9680000000000009},{"$f":"SUMPRODUCT((Plan!$B$2:$B$68=$A3)*(Plan!$A$2:$A$68=$A$7)*(Plan!$C$1:$K$1=E$2)*(Plan!$C$2:$K$68))","v":8.0510000000000002},{"$f":"SUMPRODUCT((Plan!$B$2:$B$68=$A3)*(Plan!$A$2:$A$68=$A$7)*(Plan!$C$1:$K$1=F$2)*(Plan!$C$2:$K$68))","v":8.3160000000000007},{"$f":"SUMPRODUCT((Plan!$B$2:$B$68=$A3)*(Plan!$A$2:$A$68=$A$7)*(Plan!$C$1:$K$1=G$2)*(Plan!$C$2:$K$68))","v":8.6129999999999995}]
[]
[]
[{"$f":"Lists!B5","v":"England"},{"$f":"Data!C1","v":"FY 12"},{"$f":"Data!D1","v":"FY 13"},{"$f":"Data!E1","v":"FY 14"},{"$f":"Data!F1","v":"FY 15"},{"$f":"Data!G1","v":"FY 16"},{"$f":"Data!H1","v":"FY 17"},{"$f":"Data!I1","v":"FY 18"},{"$f":"Data!J1","v":"FY 19"},{"$f":"Data!K1","v":"FY 20"}]
["Net Income",{"$f":"SUMPRODUCT((Data!$B$2:$B$68=$A8)*(Data!$A$2:$A$68=$A$7)*(Data!C$2:C$68))","v":7400},{"$f":"SUMPRODUCT((Data!$B$2:$B$68=$A8)*(Data!$A$2:$A$68=$A$7)*(Data!D$2:D$68))","v":8100},{"$f":"SUMPRODUCT((Data!$B$2:$B$68=$A8)*(Data!$A$2:$A$68=$A$7)*(Data!E$2:E$68))","v":8300},{"$f":"SUMPRODUCT((Data!$B$2:$B$68=$A8)*(Data!$A$2:$A$68=$A$7)*(Data!F$2:F$68))","v":9600},{"$f":"SUMPRODUCT((Data!$B$2:$B$68=$A8)*(Data!$A$2:$A$68=$A$7)*(Data!G$2:G$68))","v":10200},{"$f":"SUMPRODUCT((Data!$B$2:$B$68=$A8)*(Data!$A$2:$A$68=$A$7)*(Data!H$2:H$68))","v":10000},{"$f":"SUMPRODUCT((Data!$B$2:$B$68=$A8)*(Data!$A$2:$A$68=$A$7)*(Data!I$2:I$68))","v":10200},{"$f":"SUMPRODUCT((Data!$B$2:$B$68=$A8)*(Data!$A$2:$A$68=$A$7)*(Data!J$2:J$68))","v":10600},{"$f":"SUMPRODUCT((Data!$B$2:$B$68=$A8)*(Data!$A$2:$A$68=$A$7)*(Data!K$2:K$68))","v":10300}]
["Revenue",{"$f":"SUMPRODUCT((Data!$B$2:$B$68=$A9)*(Data!$A$2:$A$68=$A$7)*(Data!C$2:C$68))","v":28900},{"$f":"SUMPRODUCT((Data!$B$2:$B$68=$A9)*(Data!$A$2:$A$68=$A$7)*(Data!D$2:D$68))","v":33569},{"$f":"SUMPRODUCT((Data!$B$2:$B$68=$A9)*(Data!$A$2:$A$68=$A$7)*(Data!E$2:E$68))","v":34511},{"$f":"SUMPRODUCT((Data!$B$2:$B$68=$A9)*(Data!$A$2:$A$68=$A$7)*(Data!F$2:F$68))","v":35678},{"$f":"SUMPRODUCT((Data!$B$2:$B$68=$A9)*(Data!$A$2:$A$68=$A$7)*(Data!G$2:G$68))","v":38976},{"$f":"SUMPRODUCT((Data!$B$2:$B$68=$A9)*(Data!$A$2:$A$68=$A$7)*(Data!H$2:H$68))","v":40014},{"$f":"SUMPRODUCT((Data!$B$2:$B$68=$A9)*(Data!$A$2:$A$68=$A$7)*(Data!I$2:I$68))","v":41017.5},{"$f":"SUMPRODUCT((Data!$B$2:$B$68=$A9)*(Data!$A$2:$A$68=$A$7)*(Data!J$2:J$68))","v":42521.875},{"$f":"SUMPRODUCT((Data!$B$2:$B$68=$A9)*(Data!$A$2:$A$68=$A$7)*(Data!K$2:K$68))","v":48152.34375}]
["Diluted Earnings Per Share",{"$f":"SUMPRODUCT((Data!$B$2:$B$68=$A10)*(Data!$A$2:$A$68=$A$7)*(Data!C$2:C$68))","v":3.1},{"$f":"SUMPRODUCT((Data!$B$2:$B$68=$A10)*(Data!$A$2:$A$68=$A$7)*(Data!D$2:D$68))","v":3.2},{"$f":"SUMPRODUCT((Data!$B$2:$B$68=$A10)*(Data!$A$2:$A$68=$A$7)*(Data!E$2:E$68))","v":3.35},{"$f":"SUMPRODUCT((Data!$B$2:$B$68=$A10)*(Data!$A$2:$A$68=$A$7)*(Data!F$2:F$68))","v":3.4},{"$f":"SUMPRODUCT((Data!$B$2:$B$68=$A10)*(Data!$A$2:$A$68=$A$7)*(Data!G$2:G$68))","v":3.45},{"$f":"SUMPRODUCT((Data!$B$2:$B$68=$A10)*(Data!$A$2:$A$68=$A$7)*(Data!H$2:H$68))","v":3.6},{"$f":"SUMPRODUCT((Data!$B$2:$B$68=$A10)*(Data!$A$2:$A$68=$A$7)*(Data!I$2:I$68))","v":4.5},{"$f":"SUMPRODUCT((Data!$B$2:$B$68=$A10)*(Data!$A$2:$A$68=$A$7)*(Data!J$2:J$68))","v":5.625},{"$f":"SUMPRODUCT((Data!$B$2:$B$68=$A10)*(Data!$A$2:$A$68=$A$7)*(Data!K$2:K$68))","v":7.03125}]
{"$rows_left_out":79}
{"sheet":"Check","index":11,"n_rows":44,"n_cols":13,"rows_kept":44,"cut":false,"hidden":false,"merged":[]}
[]
[null,{"$f":"Calcs!$A$7","v":"England"},{"$f":"Calcs!B7","v":"FY 12"},{"$f":"Calcs!C7","v":"FY 13"},{"$f":"Calcs!D7","v":"FY 14"},{"$f":"Calcs!E7","v":"FY 15"},{"$f":"Calcs!F7","v":"FY 16"},{"$f":"Calcs!G7","v":"FY 17"},{"$f":"Calcs!H7","v":"FY 18"},{"$f":"Calcs!I7","v":"FY 19"},{"$f":"Calcs!J7","v":"FY 20"},null,"Check"]
[null,"Net Income",{"$f":"SUMIFS(Data!C$2:C$69,Data!$B$2:$B$69,$B3,Data!$A$2:$A$69,$B$2)","v":7400},{"$f":"SUMIFS(Data!D$2:D$69,Data!$B$2:$B$69,$B3,Data!$A$2:$A$69,$B$2)","v":8100},{"$f":"SUMIFS(Data!E$2:E$69,Data!$B$2:$B$69,$B3,Data!$A$2:$A$69,$B$2)","v":8300},{"$f":"SUMIFS(Data!F$2:F$69,Data!$B$2:$B$69,$B3,Data!$A$2:$A$69,$B$2)","v":9600},{"$f":"SUMIFS(Data!G$2:G$69,Data!$B$2:$B$69,$B3,Data!$A$2:$A$69,$B$2)","v":10200},{"$f":"SUMIFS(Data!H$2:H$69,Data!$B$2:$B$69,$B3,Data!$A$2:$A$69,$B$2)","v":10000},{"$f":"SUMIFS(Data!I$2:I$69,Data!$B$2:$B$69,$B3,Data!$A$2:$A$69,$B$2)","v":10200},{"$f":"SUMIFS(Data!J$2:J$69,Data!$B$2:$B$69,$B3,Data!$A$2:$A$69,$B$2)","v":10600},{"$f":"SUMIFS(Data!K$2:K$69,Data!$B$2:$B$69,$B3,Data!$A$2:$A$69,$B$2)","v":10300}]
[null,"Revenue",{"$f":"SUMIFS(Data!C$2:C$69,Data!$B$2:$B$69,$B4,Data!$A$2:$A$69,$B$2)","v":28900},{"$f":"SUMIFS(Data!D$2:D$69,Data!$B$2:$B$69,$B4,Data!$A$2:$A$69,$B$2)","v":33569},{"$f":"SUMIFS(Data!E$2:E$69,Data!$B$2:$B$69,$B4,Data!$A$2:$A$69,$B$2)","v":34511},{"$f":"SUMIFS(Data!F$2:F$69,Data!$B$2:$B$69,$B4,Data!$A$2:$A$69,$B$2)","v":35678},{"$f":"SUMIFS(Data!G$2:G$69,Data!$B$2:$B$69,$B4,Data!$A$2:$A$69,$B$2)","v":38976},{"$f":"SUMIFS(Data!H$2:H$69,Data!$B$2:$B$69,$B4,Data!$A$2:$A$69,$B$2)","v":40014},{"$f":"SUMIFS(Data!I$2:I$69,Data!$B$2:$B$69,$B4,Data!$A$2:$A$69,$B$2)","v":41017.5},{"$f":"SUMIFS(Data!J$2:J$69,Data!$B$2:$B$69,$B4,Data!$A$2:$A$69,$B$2)","v":42521.875},{"$f":"SUMIFS(Data!K$2:K$69,Data!$B$2:$B$69,$B4,Data!$A$2:$A$69,$B$2)","v":48152.34375}]
[null,"Diluted Earnings Per Share",{"$f":"SUMIFS(Data!C$2:C$69,Data!$B$2:$B$69,$B5,Data!$A$2:$A$69,$B$2)","v":3.1},{"$f":"SUMIFS(Data!D$2:D$69,Data!$B$2:$B$69,$B5,Data!$A$2:$A$69,$B$2)","v":3.2},{"$f":"SUMIFS(Data!E$2:E$69,Data!$B$2:$B$69,$B5,Data!$A$2:$A$69,$B$2)","v":3.35},{"$f":"SUMIFS(Data!F$2:F$69,Data!$B$2:$B$69,$B5,Data!$A$2:$A$69,$B$2)","v":3.4},{"$f":"SUMIFS(Data!G$2:G$69,Data!$B$2:$B$69,$B5,Data!$A$2:$A$69,$B$2)","v":3.45},{"$f":"SUMIFS(Data!H$2:H$69,Data!$B$2:$B$69,$B5,Data!$A$2:$A$69,$B$2)","v":3.6},{"$f":"SUMIFS(Data!I$2:I$69,Data!$B$2:$B$69,$B5,Data!$A$2:$A$69,$B$2)","v":4.5},{"$f":"SUMIFS(Data!J$2:J$69,Data!$B$2:$B$69,$B5,Data!$A$2:$A$69,$B$2)","v":5.625},{"$f":"SUMIFS(Data!K$2:K$69,Data!$B$2:$B$69,$B5,Data!$A$2:$A$69,$B$2)","v":7.03125}]
[null,"Dividends Per Share",{"$f":"SUMIFS(Data!C$2:C$69,Data!$B$2:$B$69,$B6,Data!$A$2:$A$69,$B$2)","v":0.97},{"$f":"SUMIFS(Data!D$2:D$69,Data!$B$2:$B$69,$B6,Data!$A$2:$A$69,$B$2)","v":1.05},{"$f":"SUMIFS(Data!E$2:E$69,Data!$B$2:$B$69,$B6,Data!$A$2:$A$69,$B$2)","v":1.1100000000000001},{"$f":"SUMIFS(Data!F$2:F$69,Data!$B$2:$B$69,$B6,Data!$A$2:$A$69,$B$2)","v":1.2},{"$f":"SUMIFS(Data!G$2:G$69,Data!$B$2:$B$69,$B6,Data!$A$2:$A$69,$B$2)","v":1.23},{"$f":"SUMIFS(Data!H$2:H$69,Data!$B$2:$B$69,$B6,Data!$A$2:$A$69,$B$2)","v":1.28},{"$f":"SUMIFS(Data!I$2:I$69,Data!$B$2:$B$69,$B6,Data!$A$2:$A$69,$B$2)","v":1.6},{"$f":"SUMIFS(Data!J$2:J$69,Data!$B$2:$B$69,$B6,Data!$A$2:$A$69,$B$2)","v":2},{"$f":"SUMIFS(Data!K$2:K$69,Data!$B$2:$B$69,$B6,Data!$A$2:$A$69,$B$2)","v":2.5}]
[null,"Return on Assets",{"$f":"SUMIFS(Data!C$2:C$69,Data!$B$2:$B$69,$B7,Data!$A$2:$A$69,$B$2)","v":2.6},{"$f":"SUMIFS(Data!D$2:D$69,Data!$B$2:$B$69,$B7,Data!$A$2:$A$69,$B$2)","v":2.4},{"$f":"SUMIFS(Data!E$2:E$69,Data!$B$2:$B$69,$B7,Data!$A$2:$A$69,$B$2)","v":2.6},{"$f":"SUMIFS(Data!F$2:F$69,Data!$B$2:$B$69,$B7,Data!$A$2:$A$69,$B$2)","v":2.5},{"$f":"SUMIFS(Data!G$2:G$69,Data!$B$2:$B$69,$B7,Data!$A$2:$A$69,$B$2)","v":2.5},{"$f":"SUMIFS(Data!H$2:H$69,Data!$B$2:$B$69,$B7,Data!$A$2:$A$69,$B$2)","v":2.6},{"$f":"SUMIFS(Data!I$2:I$69,Data!$B$2:$B$69,$B7,Data!$A$2:$A$69,$B$2)","v":3.25},{"$f":"SUMIFS(Data!J$2:J$69,Data!$B$2:$B$69,$B7,Data!$A$2:$A$69,$B$2)","v":4.0625},{"$f":"SUMIFS(Data!K$2:K$69,Data!$B$2:$B$69,$B7,Data!$A$2:$A$69,$B$2)","v":5.078125}]
[null,"Return on Equity",{"$f":"SUMIFS(Data!C$2:C$69,Data!$B$2:$B$69,$B8,Data!$A$2:$A$69,$B$2)","v":23.4},{"$f":"SUMIFS(Data!D$2:D$69,Data!$B$2:$B$69,$B8,Data!$A$2:$A$69,$B$2)","v":22.7},{"$f":"SUMIFS(Data!E$2:E$69,Data!$B$2:$B$69,$B8,Data!$A$2:$A$69,$B$2)","v":26.8},{"$f":"SUMIFS(Data!F$2:F$69,Data!$B$2:$B$69,$B8,Data!$A$2:$A$69,$B$2)","v":25.7},{"$f":"SUMIFS(Data!G$2:G$69,Data!$B$2:$B$69,$B8,Data!$A$2:$A$69,$B$2)","v":27.6},{"$f":"SUMIFS(Data!H$2:H$69,Data!$B$2:$B$69,$B8,Data!$A$2:$A$69,$B$2)","v":28.6},{"$f":"SUMIFS(Data!I$2:I$69,Data!$B$2:$B$69,$B8,Data!$A$2:$A$69,$B$2)","v":30.75},{"$f":"SUMIFS(Data!J$2:J$69,Data!$B$2:$B$69,$B8,Data!$A$2:$A$69,$B$2)","v":25.6875},{"$f":"SUMIFS(Data!K$2:K$69,Data!$B$2:$B$69,$B8,Data!$A$2:$A$69,$B$2)","v":22.859375}]
[null,"Net Interest Margin",{"$f":"SUMIFS(Data!C$2:C$69,Data!$B$2:$B$69,$B9,Data!$A$2:$A$69,$B$2)","v":7.5},{"$f":"SUMIFS(Data!D$2:D$69,Data!$B$2:$B$69,$B9,Data!$A$2:$A$69,$B$2)","v":7.8},{"$f":"SUMIFS(Data!E$2:E$69,Data!$B$2:$B$69,$B9,Data!$A$2:$A$69,$B$2)","v":8.3000000000000007},{"$f":"SUMIFS(Data!F$2:F$69,Data!$B$2:$B$69,$B9,Data!$A$2:$A$69,$B$2)","v":8.3000000000000007},{"$f":"SUMIFS(Data!G$2:G$69,Data!$B$2:$B$69,$B9,Data!$A$2:$A$69,$B$2)","v":8.4},{"$f":"SUMIFS(Data!H$2:H$69,Data!$B$2:$B$69,$B9,Data!$A$2:$A$69,$B$2)","v":8.6999999999999993},{"$f":"SUMIFS(Data!I$2:I$69,Data!$B$2:$B$69,$B9,Data!$A$2:$A$69,$B$2)","v":8.875},{"$f":"SUMIFS(Data!J$2:J$69,Data!$B$2:$B$69,$B9,Data!$A$2:$A$69,$B$2)","v":9},{"$f":"SUMIFS(Data!K$2:K$69,Data!$B$2:$B$69,$B9,Data!$A$2:$A$69,$B$2)","v":8.6999999999999993}]
[null,"Efficiency Ratio",{"$f":"SUMIFS(Data!C$2:C$69,Data!$B$2:$B$69,$B10,Data!$A$2:$A$69,$B$2)","v":0.84},{"$f":"SUMIFS(Data!D$2:D$69,Data!$B$2:$B$69,$B10,Data!$A$2:$A$69,$B$2)","v":0.9},{"$f":"SUMIFS(Data!E$2:E$69,Data!$B$2:$B$69,$B10,Data!$A$2:$A$69,$B$2)","v":0.85},{"$f":"SUMIFS(Data!F$2:F$69,Data!$B$2:$B$69,$B10,Data!$A$2:$A$69,$B$2)","v":0.87},{"$f":"SUMIFS(Data!G$2:G$69,Data!$B$2:$B$69,$B10,Data!$A$2:$A$69,$B$2)","v":0.84},{"$f":"SUMIFS(Data!H$2:H$69,Data!$B$2:$B$69,$B10,Data!$A$2:$A$69,$B$2)","v":0.88},{"$f":"SUMIFS(Data!I$2:I$69,Data!$B$2:$B$69,$B10,Data!$A$2:$A$69,$B$2)","v":1.1000000000000001},{"$f":"SUMIFS(Data!J$2:J$69,Data!$B$2:$B$69,$B10,Data!$A$2:$A$69,$B$2)","v":1.375},{"$f":"SUMIFS(Data!K$2:K$69,Data!$B$2:$B$69,$B10,Data!$A$2:$A$69,$B$2)","v":1.71875}]
{"$rows_left_out":35}
{"sheet":"Summary","index":12,"n_rows":45,"n_cols":20,"rows_kept":45,"cut":false,"hidden":false,"merged":[]}
[]
[]
[]
[]
[null,1]
[]
[]
[]
[]
[null,null,null,null," Financial Measure",null,null,null,null,{"$f":"OFFSET(Lists!E1,$B$5,0,1,1)","v":"FY 12"},{"$f":"OFFSET(Lists!$E$1,MATCH(J10,Lists!$E$1:$E$12,0),0,1,1)","v":"FY 13"},{"$f":"OFFSET(Lists!$E$1,MATCH(K10,Lists!$E$1:$E$12,0),0,1,1)","v":"FY 14"},{"$f":"OFFSET(Lists!$E$1,MATCH(L10,Lists!$E$1:$E$12,0),0,1,1)","v":"FY 15"},{"$f":"OFFSET(Lists!$E$1,MATCH(M10,Lists!$E$1:$E$12,0),0,1,1)","v":"FY 16"},{"$f":"OFFSET(Lists!$E$1,MATCH(N10,Lists!$E$1:$E$12,0),0,1,1)","v":"FY 17"},null,null,"Hires and Terminations"]
{"$rows_left_out":35}